Target
Genome polyprotein
Ligand
BDBM50366760
Substrate
Meas. Tech.
ChEMBL_143617 (CHEMBL751677)
Ki
12±n/a nM
Citation
 Johansson, AHubatsch, IAkerblom, ELindeberg, GWiniwarter, SDanielson, UHHallberg, A Inhibition of hepatitis C virus NS3 protease activity by product-based peptides is dependent on helicase domain. Bioorg Med Chem Lett 11:203-6 (2001)  
Target
Name:
Genome polyprotein
Synonyms:
Hepatitis C virus NS3 protease/helicase | Hepatitis C virus serine protease, NS3/NS4A
Type:
Protein
Mol. Mass.:
67067.41
Organism:
Hepatitis C virus
Description:
A3EZI9
Residue:
631
  
Inhibitor
Name:
BDBM50366760
Synonyms:
CHEMBL2369589
Type:
Small organic molecule
Emp. Form.:
C36H58N6O14S
Mol. Mass.:
830.943
SMILES:
CC[C@H](C)[C@H](NC(=O)[C@H](CC(C)C)NC(=O)[C@@H](CC(C(O)=O)C(O)=O)NC(=O)[C@H](CC(O)=O)NC(C)=O)C(=O)N[C@@H](CC1CCCCC1)C(=O)N[C@@H](CS)C(O)=O
: