Target
Genome polyprotein
Ligand
BDBM50096411
Substrate
Meas. Tech.
ChEMBL_143618 (CHEMBL751678)
Ki
30±n/a nM
Citation
 Johansson, AHubatsch, IAkerblom, ELindeberg, GWiniwarter, SDanielson, UHHallberg, A Inhibition of hepatitis C virus NS3 protease activity by product-based peptides is dependent on helicase domain. Bioorg Med Chem Lett 11:203-6 (2001)  
Target
Name:
Genome polyprotein
Synonyms:
Hepatitis C virus NS3 protease/helicase | Hepatitis C virus serine protease, NS3/NS4A
Type:
Protein
Mol. Mass.:
67067.41
Organism:
Hepatitis C virus
Description:
A3EZI9
Residue:
631
  
Inhibitor
Name:
BDBM50096411
Synonyms:
AcAsp-Glu-Dif-Ile-Cha-Cys | CHEMBL61390
Type:
Small organic molecule
Emp. Form.:
C44H60N6O12S
Mol. Mass.:
897.045
SMILES:
CC[C@@H](C)[C@@H](NC(=O)[C@@H](NC(=O)[C@H](CCC(O)=O)NC(=O)[C@H](CC(O)=O)NC(C)=O)C(c1ccccc1)c1ccccc1)C(=O)N[C@@H](CC1CCCCC1)C(=O)N[C@H](CS)C(O)=O
: