Target
Genome polyprotein
Ligand
BDBM50084685
Substrate
Meas. Tech.
ChEBML_143618
Ki
41±n/a nM
Citation
 Johansson, AHubatsch, IAkerblom, ELindeberg, GWiniwarter, SDanielson, UHHallberg, A Inhibition of hepatitis C virus NS3 protease activity by product-based peptides is dependent on helicase domain. Bioorg Med Chem Lett 11:203-6 (2001)  
Target
Name:
Genome polyprotein
Synonyms:
Hepatitis C virus NS3 protease/helicase | Hepatitis C virus serine protease, NS3/NS4A
Type:
Protein
Mol. Mass.:
67067.41
Organism:
Hepatitis C virus
Description:
A3EZI9
Residue:
631
  
Inhibitor
Name:
BDBM50084685
Synonyms:
4-(2-Acetylamino-3-carboxy-propionylamino)-4-(1-{3-carboxy-1-[1-(1-carboxy-2-mercapto-ethylcarbamoyl)-2-cyclohexyl-ethylcarbamoyl]-propylcarbamoyl}-2,2-diphenyl-ethylcarbamoyl)-butyric acid CHEMBL417559
Type:
Small organic molecule
Emp. Form.:
C43H56N6O14S
Mol. Mass.:
913.002
SMILES:
CC(=O)N[C@@H](CC(O)=O)C(=O)N[C@@H](CCC(O)=O)C(=O)N[C@@H](C(c1ccccc1)c1ccccc1)C(=O)N[C@@H](CCC(O)=O)C(=O)N[C@@H](CC1CCCCC1)C(=O)N[C@@H](CS)C(O)=O
: