Target
Genome polyprotein
Ligand
BDBM50096410
Substrate
Meas. Tech.
ChEMBL_143618 (CHEMBL751678)
Ki
23±n/a nM
Citation
 Johansson, AHubatsch, IAkerblom, ELindeberg, GWiniwarter, SDanielson, UHHallberg, A Inhibition of hepatitis C virus NS3 protease activity by product-based peptides is dependent on helicase domain. Bioorg Med Chem Lett 11:203-6 (2001)  
Target
Name:
Genome polyprotein
Synonyms:
Hepatitis C virus NS3 protease/helicase | Hepatitis C virus serine protease, NS3/NS4A
Type:
Protein
Mol. Mass.:
67067.41
Organism:
Hepatitis C virus
Description:
A3EZI9
Residue:
631
  
Inhibitor
Name:
BDBM50096410
Synonyms:
AcAsp-D-Glu-Leu-Glu-Cha-Cys | CHEMBL60967
Type:
Small organic molecule
Emp. Form.:
C34H54N6O14S
Mol. Mass.:
802.889
SMILES:
CC(C)C[C@H](NC(=O)[C@@H](CCC(O)=O)NC(=O)[C@H](CC(O)=O)NC(C)=O)C(=O)N[C@@H](CCC(O)=O)C(=O)N[C@@H](CC1CCCCC1)C(=O)N[C@@H](CS)C(O)=O
: