Target
Genome polyprotein
Ligand
BDBM50096409
Substrate
Meas. Tech.
ChEMBL_143618 (CHEMBL751678)
Ki
400±n/a nM
Citation
 Johansson, AHubatsch, IAkerblom, ELindeberg, GWiniwarter, SDanielson, UHHallberg, A Inhibition of hepatitis C virus NS3 protease activity by product-based peptides is dependent on helicase domain. Bioorg Med Chem Lett 11:203-6 (2001)  
Target
Name:
Genome polyprotein
Synonyms:
Hepatitis C virus NS3 protease/helicase | Hepatitis C virus serine protease, NS3/NS4A
Type:
Protein
Mol. Mass.:
67067.41
Organism:
Hepatitis C virus
Description:
A3EZI9
Residue:
631
  
Inhibitor
Name:
BDBM50096409
Synonyms:
AcAsp-Glu-Met-Glu-Cha-Cys | CHEMBL64867
Type:
Small organic molecule
Emp. Form.:
C37H48N6O14S2
Mol. Mass.:
864.939
SMILES:
CSCC[C@H](NC(=O)[C@H](CCC(O)=O)NC(=O)[C@H](CC(O)=O)NC(C)=O)C(=O)N[C@@H](CCC(O)=O)C(=O)N[C@@H](Cc1ccc2ccccc2c1)C(=O)N[C@@H](CS)C(O)=O
: