Target
Genome polyprotein
Ligand
BDBM50096406
Substrate
Meas. Tech.
ChEMBL_143617 (CHEMBL751677)
Ki
4100±n/a nM
Citation
 Johansson, AHubatsch, IAkerblom, ELindeberg, GWiniwarter, SDanielson, UHHallberg, A Inhibition of hepatitis C virus NS3 protease activity by product-based peptides is dependent on helicase domain. Bioorg Med Chem Lett 11:203-6 (2001)  
Target
Name:
Genome polyprotein
Synonyms:
Hepatitis C virus NS3 protease/helicase | Hepatitis C virus serine protease, NS3/NS4A
Type:
Protein
Mol. Mass.:
67067.41
Organism:
Hepatitis C virus
Description:
A3EZI9
Residue:
631
  
Inhibitor
Name:
BDBM50096406
Synonyms:
Ac-Glu-Cha-Cys | CHEMBL303340
Type:
Small organic molecule
Emp. Form.:
C19H31N3O7S
Mol. Mass.:
445.53
SMILES:
CC(=O)N[C@@H](CCC(O)=O)C(=O)N[C@@H](CC1CCCCC1)C(=O)N[C@@H](CS)C(O)=O
: