Target
Tyrosine-protein phosphatase non-receptor type 1
Ligand
BDBM50404357
Substrate
Meas. Tech.
ChEBML_154471
IC50
26000±n/a nM
Citation
 Shrestha, SShim, YSKim, KCLee, KHCho, H Evans Blue and other dyes as protein tyrosine phosphatase inhibitors. Bioorg Med Chem Lett 14:1923-6 (2004)  
Target
Name:
Tyrosine-protein phosphatase non-receptor type 1
Synonyms:
PTN1_HUMAN PTPN1 Protein tyrosine phosphatase-1B (PTP1B) Protein-tyrosine phosphatase 1B (PTP1B) Tyrosine-protein phosphatase non-receptor type 1 (PTP1B)
Type:
Protein phosphatase
Mol. Mass.:
49963.76
Organism:
Homo sapiens (Human)
Description:
Human recombinant GST-fusion PTP1B (1-435).
Residue:
435
  
Inhibitor
Name:
BDBM50404357
Synonyms:
CARMINE
Type:
Small organic molecule
Emp. Form.:
C22H20O13
Mol. Mass.:
492.3864
SMILES:
Cc1c(C(O)=O)c(O)cc2C(=O)c3c(O)c(O)c([C@H]4O[C@H](CO)[C@@H](O)[C@H](O)[C@H]4O)c(O)c3C(=O)c12
: