Target
Tyrosine-protein phosphatase 1
Ligand
BDBM50404357
Substrate
Meas. Tech.
ChEBML_217570
IC50
15000±n/a nM
Citation
 Shrestha, SShim, YSKim, KCLee, KHCho, H Evans Blue and other dyes as protein tyrosine phosphatase inhibitors. Bioorg Med Chem Lett 14:1923-6 (2004)  
Target
Name:
Tyrosine-protein phosphatase 1
Synonyms:
PTP1 Protein-tyrosine phosphatase 1
Type:
PROTEIN
Mol. Mass.:
38875.77
Organism:
Saccharomyces cerevisiae
Description:
ChEMBL_217570
Residue:
335
  
Inhibitor
Name:
BDBM50404357
Synonyms:
CARMINE
Type:
Small organic molecule
Emp. Form.:
C22H20O13
Mol. Mass.:
492.3864
SMILES:
Cc1c(C(O)=O)c(O)cc2C(=O)c3c(O)c(O)c([C@H]4O[C@H](CO)[C@@H](O)[C@H](O)[C@H]4O)c(O)c3C(=O)c12
: