Target
Acetylcholinesterase
Ligand
BDBM50034001
Substrate
Meas. Tech.
ChEMBL_28164 (CHEMBL885303)
IC50
4.3±n/a nM
Citation
 Nagel, AAListon, DRJung, SMahar, MVincent, LAChapin, DChen, YLHubbard, SIves, JLJones, SB Design and synthesis of 1-heteroaryl-3-(1-benzyl-4-piperidinyl)propan-1-one derivatives as potent, selective acetylcholinesterase inhibitors. J Med Chem 38:1084-9 (1995)  
Target
Name:
Acetylcholinesterase
Synonyms:
ACES_HUMAN Acetylcholinesterase (AChE) | Acetylcholinesterase (human AChE)
Type:
Enzyme
Mol. Mass.:
67792.70
Organism:
Homo sapiens (Human)
Description:
P22303
Residue:
614
  
Inhibitor
Name:
BDBM50034001
Synonyms:
3-(1-Benzyl-piperidin-4-yl)-1-(1-ethyl-2-methyl-1H-benzoimidazol-5-yl)-propan-1-one; hydrochloride CHEMBL555075
Type:
Small organic molecule
Emp. Form.:
C25H31N3O
Mol. Mass.:
389.5331
SMILES:
CCn1c(C)nc2cc(ccc12)C(=O)CCC1CCN(Cc2ccccc2)CC1
: