Target
Metabotropic glutamate receptor 3
Ligand
BDBM50004863
Substrate
Meas. Tech.
ChEMBL_106537 (CHEMBL714798)
EC50
30000±n/a nM
Citation
 Kozikowski, APSteensma, DAraldi, GLTückmantel, WWang, SPshenichkin, SSurina, EWroblewski, JT Synthesis and biology of the conformationally restricted ACPD analogue, 2-aminobicyclo[2.1.1]hexane-2,5-dicarboxylic acid-I, a potent mGluR agonist. J Med Chem 41:1641-50 (1998)  
Target
Name:
Metabotropic glutamate receptor 3
Synonyms:
GPRC1C GRM3_HUMAN metabotropic glutamate 3 metabotropic glutamate 3/1c
Type:
Enzyme Catalytic Domain
Mol. Mass.:
98889.09
Organism:
Homo sapiens (Human)
Description:
metabotropic glutamate 1c 0 HUMAN::Q14832
Residue:
879
  
Inhibitor
Name:
BDBM50004863
Synonyms:
(+/-)-trans-ACPD (1S,3S)-1-aminocyclopentane-1,3-dicarboxylic acid 1-Amino-cyclopentane-1,3-dicarboxylic acid(cis-(1S,3S)-ACPD) 1R,3S-ACPD CHEMBL29726
Type:
Small organic molecule
Emp. Form.:
C7H11NO4
Mol. Mass.:
173.1665
SMILES:
N[C@]1(CC[C@@H](C1)C(O)=O)C(O)=O
: