Target
Mu-type opioid receptor
Ligand
BDBM50066531
Substrate
Meas. Tech.
ChEMBL_149015 (CHEMBL758579)
Ki
7.6±n/a nM
Citation
 Husbands, SMSadd, JBroadbear, JHWoods, JHMartin, JTraynor, JRAceto, MDBowman, ERHarris, LSLewis, JW 3-Alkyl ethers of clocinnamox: delayed long-term mu-antagonists with variable mu efficacy. J Med Chem 41:3493-8 (1998)  
Target
Name:
Mu-type opioid receptor
Synonyms:
MOR-1 Mu-type opioid receptor (MOR) OPRM_RAT Opioid receptor B Ror-b
Type:
G Protein-Coupled Receptor (GPCR)
Mol. Mass.:
44503.11
Organism:
Rattus norvegicus (rat)
Description:
Competition binding assays were carried out using membrane preparations from transfected HN9.10 cells that constitutively expressed the mu opioid receptor.
Residue:
398
  
Inhibitor
Name:
BDBM50066531
Synonyms:
methyl 2-[17-[2-(4-chlorophenyl)-(E)-1-ethenylcarboxamido]-4-cyclopropylmethyl-14-oxo-(17S)-12-oxa-4-azapentacyclo[9.6.1.01,13.05,17.07,18]octadeca-7,9,11(18)-trien-10-yloxy]acetate
Type:
Small organic molecule
Emp. Form.:
C32H33ClN2O6
Mol. Mass.:
577.067
SMILES:
COC(=O)COc1ccc2CC3N(CC4CC4)CC[C@@]45[C@@H](Oc1c24)C(=O)CC[C@@]35NC(=O)\C=C\c1ccc(Cl)cc1
: