Target
Kappa-type opioid receptor
Ligand
BDBM50066536
Substrate
Meas. Tech.
ChEMBL_145837 (CHEMBL755495)
Ki
131±n/a nM
Citation
 Husbands, SMSadd, JBroadbear, JHWoods, JHMartin, JTraynor, JRAceto, MDBowman, ERHarris, LSLewis, JW 3-Alkyl ethers of clocinnamox: delayed long-term mu-antagonists with variable mu efficacy. J Med Chem 41:3493-8 (1998)  
Target
Name:
Kappa-type opioid receptor
Synonyms:
KOR-1 OPIATE Kappa Opioid receptor Ror-d
Type:
G Protein-Coupled Receptor (GPCR)
Mol. Mass.:
42692.90
Organism:
Rattus norvegicus (rat)
Description:
P34975
Residue:
380
  
Inhibitor
Name:
BDBM50066536
Synonyms:
1N-[10-cyclopropylmethoxy-4-cyclopropylmethyl-14-oxo-(17S)-12-oxa-4-azapentacyclo[9.6.1.01,13.05,17.07,18]octadeca-7,9,11(18)-trien-17-yl]-3-(4-chlorophenyl)-(E)-2-propenamide
Type:
Small organic molecule
Emp. Form.:
C33H35ClN2O4
Mol. Mass.:
559.095
SMILES:
Clc1ccc(\C=C\C(=O)N[C@]23CCC(=O)[C@@H]4Oc5c6c(CC2N(CC2CC2)CC[C@@]346)ccc5OCC2CC2)cc1
: