Target
Alpha-1A adrenergic receptor
Ligand
BDBM112777
Substrate
Meas. Tech.
ChEMBL_33160 (CHEMBL642945)
IC50
0.04±n/a nM
Citation
 Quiñones-Torrelo, CSagrado, SVillanueva-Camañas, RMMedina-Hernández, MJ Development of predictive retention-activity relationship models of tricyclic antidepressants by micellar liquid chromatography. J Med Chem 42:3154-62 (1999)  
Target
Name:
Alpha-1A adrenergic receptor
Synonyms:
ADA1A_RAT Adra1c Alpha-1A adrenoceptor Alpha-1C adrenergic receptor | adrenergic Alpha1A
Type:
Protein
Mol. Mass.:
51620.15
Organism:
Rattus norvegicus (Rat)
Description:
P43140
Residue:
466
  
Inhibitor
Name:
BDBM112777
Synonyms:
NORTRIPTYLINE | US8629135, SW-02
Type:
Small organic molecule
Emp. Form.:
C19H21N
Mol. Mass.:
263.3767
SMILES:
[#6]-[#7]-[#6]-[#6]\[#6]=[#6]-1/c2ccccc2-[#6]-[#6]-c2ccccc-12
: