Target
Gag-Pol polyprotein [489-587]
Ligand
BDBM50366785
Substrate
Meas. Tech.
ChEMBL_222918 (CHEMBL842692)
Ki
27±n/a nM
Citation
 Dorsey, BDMcDonough, CMcDaniel, SLLevin, RBNewton, CLHoffman, JMDarke, PLZugay-Murphy, JAEmini, EASchleif, WAOlsen, DBStahlhut, MWRutkowski, CAKuo, LCLin, JHChen, IWMichelson, SRHolloway, MKHuff, JRVacca, JP Identification of MK-944a: a second clinical candidate from the hydroxylaminepentanamide isostere series of HIV protease inhibitors. J Med Chem 43:3386-99 (2000)  
Target
Name:
Gag-Pol polyprotein [489-587]
Synonyms:
Human immunodeficiency virus type 1 protease Pol polyprotein | gag-pol
Type:
Enzyme Subunit
Mol. Mass.:
10781.16
Organism:
Human immunodeficiency virus type 1
Description:
P04585[489-587]
Residue:
99
  
Inhibitor
Name:
BDBM50366785
Synonyms:
NELFINAVIR
Type:
Small organic molecule
Emp. Form.:
C32H45N3O4S
Mol. Mass.:
567.782
SMILES:
Cc1c(O)cccc1C(=O)N[C@H](CSc1ccccc1)[C@H](O)CN1C[C@H]2CCCC[C@H]2C[C@H]1C(=O)NC(C)(C)C
: