Target
Oxysterols receptor LXR-beta
Ligand
BDBM50167694
Substrate
Meas. Tech.
ChEMBL_306648 (CHEMBL832985)
IC50
2±n/a nM
Citation
 Singh, SBOndeyka, JGLiu, WChen, SChen, TSLi, XBouffard, ADropinski, JJones, ABMcCormick, SHayes, NWang, JSharma, NMacnaul, KHernandez, MChao, YSBaffic, JLam, MHBurton, CSparrow, CPMenke, JG Discovery and development of dimeric podocarpic acid leads as potent agonists of liver X receptor with HDL cholesterol raising activity in mice and hamsters. Bioorg Med Chem Lett 15:2824-8 (2005)  
Target
Name:
Oxysterols receptor LXR-beta
Synonyms:
LXRB Liver X, LXR beta NR1H2 Nuclear receptor NER Ubiquitously-expressed nuclear receptor
Type:
Enzyme Catalytic Domain
Mol. Mass.:
50978.79
Organism:
Homo sapiens (Human)
Description:
P55055
Residue:
460
  
Inhibitor
Name:
BDBM50167694
Synonyms:
2,6-dimethyl-13-methylcarbonyloxy-(2S)-tricyclo[8.4.0.02,7]tetradeca-1(10),11,13-triene-6-carboxylic 2,6-dimethyl-13-methylcarbonyloxy-(2S,6S,7R)-tricyclo[8.4.0.02,7]tetradeca-1(14),10,12-triene-6-carboxylic anhydride CHEMBL191965
Type:
Small organic molecule
Emp. Form.:
C38H46O7
Mol. Mass.:
614.7676
SMILES:
CC(=O)Oc1ccc2CC[C@H]3C(C)(CCC[C@]3(C)c2c1)C(=O)OC(=O)[C@@]1(C)CCC[C@@]2(C)[C@H]1CCc1ccc(OC(C)=O)cc21
: