Target
Cannabinoid receptor 1
Ligand
BDBM50172907
Substrate
Meas. Tech.
ChEMBL_320879 (CHEMBL884804)
Ki
24±n/a nM
Citation
 Lange, JHvan Stuivenberg, HHVeerman, WWals, HCStork, BCoolen, HKMcCreary, ACAdolfs, TJKruse, CG Novel 3,4-diarylpyrazolines as potent cannabinoid CB1 receptor antagonists with lower lipophilicity. Bioorg Med Chem Lett 15:4794-8 (2005)  
Target
Name:
Cannabinoid receptor 1
Synonyms:
CANN6 CB-R CNR CNR1_HUMAN Cannabinoid receptor Cannabinoid receptor 1 (brain)
Type:
G Protein-Coupled Receptor (GPCR)
Mol. Mass.:
52868.96
Organism:
Homo sapiens (Human)
Description:
P21554
Residue:
472
  
Inhibitor
Name:
BDBM50172907
Synonyms:
3,4-diarylpyrazoline derivative | CHEMBL383580
Type:
Small organic molecule
Emp. Form.:
C21H24ClN5O2S2
Mol. Mass.:
478.031
SMILES:
CN=C(NS(=O)(=O)N1CCSCC1)N1CC(C(=N1)c1ccc(Cl)cc1)c1ccccc1
: