Target
Cannabinoid receptor 2
Ligand
BDBM50172902
Substrate
Meas. Tech.
ChEMBL_320878 (CHEMBL884803)
Ki
2584±n/a nM
Citation
 Lange, JHvan Stuivenberg, HHVeerman, WWals, HCStork, BCoolen, HKMcCreary, ACAdolfs, TJKruse, CG Novel 3,4-diarylpyrazolines as potent cannabinoid CB1 receptor antagonists with lower lipophilicity. Bioorg Med Chem Lett 15:4794-8 (2005)  
Target
Name:
Cannabinoid receptor 2
Synonyms:
CANNABINOID CB2 CB2 CB2B CNR2_HUMAN Cannabinoid CB2 receptor Cannabinoid receptor 2 (CB2R) | hCB2
Type:
G Protein-Coupled Receptor (GPCR)
Mol. Mass.:
39690.94
Organism:
Homo sapiens (Human)
Description:
P34972
Residue:
360
  
Inhibitor
Name:
BDBM50172902
Synonyms:
3,4-diarylpyrazoline derivative | CHEMBL197099
Type:
Small organic molecule
Emp. Form.:
C24H30ClN5O2S
Mol. Mass.:
488.045
SMILES:
CN=C(NS(=O)(=O)N1CCCCCCC1)N1CC(C(=N1)c1ccc(Cl)cc1)c1ccccc1
: