Target
Metabotropic glutamate receptor 8
Ligand
BDBM50207814
Substrate
Meas. Tech.
ChEMBL_443092 (CHEMBL892223)
Ki
63000±n/a nM
Citation
 Marinozzi, MSerpi, MAmori, LGavilan Diaz, MCostantino, GMeyer, UFlor, PJGasparini, FHeckendorn, RKuhn, RGiorgi, GHermit, MBThomsen, CPellicciari, R Synthesis and preliminary pharmacological evaluation of the four stereoisomers of (2S)-2-(2'-phosphono-3'-phenylcyclopropyl)glycine, the first class of 3'-substituted trans C1'-2'-2-(2'-phosphonocyclopropyl)glycines. Bioorg Med Chem 15:3161-70 (2007)  
Target
Name:
Metabotropic glutamate receptor 8
Synonyms:
GRM8_RAT Grm8 Metabotropic glutamate receptor 8 (mGlu8) glutamate receptor, metabotropic 8 precursor metabotropic glutamate 8
Type:
Enzyme
Mol. Mass.:
101886.18
Organism:
Rattus norvegicus (Rat)
Description:
P70579
Residue:
908
  
Inhibitor
Name:
BDBM50207814
Synonyms:
(2S,1'R,2'S)-2-(2'-phosphonocyclopropyl)glycine | CHEMBL442076
Type:
Small organic molecule
Emp. Form.:
C5H10NO5P
Mol. Mass.:
195.1104
SMILES:
NC([C@H]1C[C@@H]1P(O)(O)=O)C(O)=O
: