Target
Trans-2-enoyl-ACP reductase II
Ligand
BDBM50371154
Substrate
Meas. Tech.
ChEMBL_445899 (CHEMBL896189)
IC50
34±n/a nM
Citation
 Kitagawa, HOzawa, TTakahata, SIida, MSaito, JYamada, M Phenylimidazole derivatives of 4-pyridone as dual inhibitors of bacterial enoyl-acyl carrier protein reductases FabI and FabK. J Med Chem 50:4710-20 (2007)  
Target
Name:
Trans-2-enoyl-ACP reductase II
Synonyms:
Enoyl-ACP Reductase (FabK) NADH-dependent, FAD-containing enoyl-ACP | trans-2-enoyl-ACP reductase II
Type:
Enzyme
Mol. Mass.:
34170.89
Organism:
Streptococcus pneumoniae
Description:
Residue:
324
  
Inhibitor
Name:
BDBM50371154
Synonyms:
CHEMBL242241
Type:
Small organic molecule
Emp. Form.:
C21H17N6O4S2
Mol. Mass.:
481.528
SMILES:
[O-]C(=O)COc1ccc(cc1)-c1c[nH]c(CNC(=O)Nc2ncc(Sc3ccccn3)s2)n1
: