Target
Trans-2-enoyl-ACP reductase II
Ligand
BDBM50371157
Substrate
Meas. Tech.
ChEMBL_445899 (CHEMBL896189)
IC50
6600±n/a nM
Citation
 Kitagawa, HOzawa, TTakahata, SIida, MSaito, JYamada, M Phenylimidazole derivatives of 4-pyridone as dual inhibitors of bacterial enoyl-acyl carrier protein reductases FabI and FabK. J Med Chem 50:4710-20 (2007)  
Target
Name:
Trans-2-enoyl-ACP reductase II
Synonyms:
Enoyl-ACP Reductase (FabK) NADH-dependent, FAD-containing enoyl-ACP | trans-2-enoyl-ACP reductase II
Type:
Enzyme
Mol. Mass.:
34170.89
Organism:
Streptococcus pneumoniae
Description:
Residue:
324
  
Inhibitor
Name:
BDBM50371157
Synonyms:
CHEMBL390218
Type:
Small organic molecule
Emp. Form.:
C30H27BrCl2N6O2S
Mol. Mass.:
686.449
SMILES:
Cc1c(Cc2c(Cl)cccc2Cl)c(=O)ccn1CCCc1ccc(cc1)-c1c[nH]c(CNC(=O)Nc2ncc(Br)s2)n1
: