Target
Growth hormone secretagogue receptor type 1
Ligand
BDBM50222865
Substrate
Meas. Tech.
ChEMBL_446527 (CHEMBL895698)
Ki
39±n/a nM
Citation
 Rudolph, JEsler, WPO'connor, SCoish, PDWickens, PLBrands, MBierer, DEBloomquist, BTBondar, GChen, LChuang, CYClaus, THFathi, ZFu, WKhire, URKristie, JALiu, XGLowe, DBMcClure, ACMichels, MOrtiz, AARamsden, PDSchoenleber, RWShelekhin, TEVakalopoulos, ATang, WWang, LYi, LGardell, SJLivingston, JNSweet, LJBullock, WH Quinazolinone derivatives as orally available ghrelin receptor antagonists for the treatment of diabetes and obesity. J Med Chem 50:5202-16 (2007)  
Target
Name:
Growth hormone secretagogue receptor type 1
Synonyms:
Ghrelin receptor
Type:
PROTEIN
Mol. Mass.:
41494.35
Organism:
Ovis aries
Description:
ChEMBL_446527
Residue:
366
  
Inhibitor
Name:
BDBM50222865
Synonyms:
6-(4-fluorophenyl)-2-isopropyl-3-[(1-isopropylpiperidin-3-yl)-methyl]quinazolin-4(3H)-one | CHEMBL244521
Type:
Small organic molecule
Emp. Form.:
C26H32FN3O
Mol. Mass.:
421.5502
SMILES:
CC(C)N1CCC[C@H](Cn2c(nc3ccc(cc3c2=O)-c2ccc(F)cc2)C(C)C)C1
: