Target
Growth hormone secretagogue receptor type 1
Ligand
BDBM50222881
Substrate
Meas. Tech.
ChEMBL_446527 (CHEMBL895698)
Ki
16±n/a nM
Citation
 Rudolph, JEsler, WPO'connor, SCoish, PDWickens, PLBrands, MBierer, DEBloomquist, BTBondar, GChen, LChuang, CYClaus, THFathi, ZFu, WKhire, URKristie, JALiu, XGLowe, DBMcClure, ACMichels, MOrtiz, AARamsden, PDSchoenleber, RWShelekhin, TEVakalopoulos, ATang, WWang, LYi, LGardell, SJLivingston, JNSweet, LJBullock, WH Quinazolinone derivatives as orally available ghrelin receptor antagonists for the treatment of diabetes and obesity. J Med Chem 50:5202-16 (2007)  
Target
Name:
Growth hormone secretagogue receptor type 1
Synonyms:
Ghrelin receptor
Type:
PROTEIN
Mol. Mass.:
41494.35
Organism:
Ovis aries
Description:
ChEMBL_446527
Residue:
366
  
Inhibitor
Name:
BDBM50222881
Synonyms:
(S)-3-((1-ethylpiperidin-3-yl)methyl)-2-o-tolyl-6-(trifluoromethoxy)quinazolin-4(3H)-one | CHEMBL244667
Type:
Small organic molecule
Emp. Form.:
C24H26F3N3O2
Mol. Mass.:
445.4773
SMILES:
CCN1CCC[C@H](Cn2c(nc3ccc(OC(F)(F)F)cc3c2=O)-c2ccccc2C)C1
: