Target
Trans-2-enoyl-ACP reductase II
Ligand
BDBM50223355
Substrate
Meas. Tech.
ChEMBL_450119 (CHEMBL900394)
IC50
4500±n/a nM
Citation
 Ozawa, TKitagawa, HYamamoto, YTakahata, SIida, MOsaki, YYamada, K Phenylimidazole derivatives as specific inhibitors of bacterial enoyl-acyl carrier protein reductase FabK. Bioorg Med Chem 15:7325-36 (2007)  
Target
Name:
Trans-2-enoyl-ACP reductase II
Synonyms:
Enoyl-ACP Reductase (FabK) NADH-dependent, FAD-containing enoyl-ACP | trans-2-enoyl-ACP reductase II
Type:
Enzyme
Mol. Mass.:
34170.89
Organism:
Streptococcus pneumoniae
Description:
Residue:
324
  
Inhibitor
Name:
BDBM50223355
Synonyms:
1-((1H-benzo[d]imidazol-2-yl)methyl)-3-(6-cyanobenzo[d]thiazol-2-yl)urea | CHEMBL237836
Type:
Small organic molecule
Emp. Form.:
C17H12N6OS
Mol. Mass.:
348.382
SMILES:
O=C(NCc1nc2ccccc2[nH]1)Nc1nc2ccc(cc2s1)C#N
: