Target
Trans-2-enoyl-ACP reductase II
Ligand
BDBM50223359
Substrate
Meas. Tech.
ChEMBL_450119 (CHEMBL900394)
IC50
>32000±n/a nM
Citation
 Ozawa, TKitagawa, HYamamoto, YTakahata, SIida, MOsaki, YYamada, K Phenylimidazole derivatives as specific inhibitors of bacterial enoyl-acyl carrier protein reductase FabK. Bioorg Med Chem 15:7325-36 (2007)  
Target
Name:
Trans-2-enoyl-ACP reductase II
Synonyms:
Enoyl-ACP Reductase (FabK) NADH-dependent, FAD-containing enoyl-ACP | trans-2-enoyl-ACP reductase II
Type:
Enzyme
Mol. Mass.:
34170.89
Organism:
Streptococcus pneumoniae
Description:
Residue:
324
  
Inhibitor
Name:
BDBM50223359
Synonyms:
2-(1H-benzo[d]imidazol-2-ylthio)-N-(benzo[d]thiazol-2-ylmethyl)acetamide | CHEMBL237448
Type:
Small organic molecule
Emp. Form.:
C17H14N4OS2
Mol. Mass.:
354.449
SMILES:
O=C(CSc1nc2ccccc2[nH]1)NCc1nc2ccccc2s1
: