Target
Trans-2-enoyl-ACP reductase II
Ligand
BDBM50223363
Substrate
Meas. Tech.
ChEMBL_450119 (CHEMBL900394)
IC50
98±n/a nM
Citation
 Ozawa, TKitagawa, HYamamoto, YTakahata, SIida, MOsaki, YYamada, K Phenylimidazole derivatives as specific inhibitors of bacterial enoyl-acyl carrier protein reductase FabK. Bioorg Med Chem 15:7325-36 (2007)  
Target
Name:
Trans-2-enoyl-ACP reductase II
Synonyms:
Enoyl-ACP Reductase (FabK) NADH-dependent, FAD-containing enoyl-ACP | trans-2-enoyl-ACP reductase II
Type:
Enzyme
Mol. Mass.:
34170.89
Organism:
Streptococcus pneumoniae
Description:
Residue:
324
  
Inhibitor
Name:
BDBM50223363
Synonyms:
4-(2-(3-((4-phenyl-1H-imidazol-2-yl)methyl)ureido)thiazol-5-ylthio)benzoic acid | CHEMBL235273
Type:
Small organic molecule
Emp. Form.:
C21H17N5O3S2
Mol. Mass.:
451.521
SMILES:
OC(=O)c1ccc(Sc2cnc(NC(=O)NCc3nc(c[nH]3)-c3ccccc3)s2)cc1
: