Target
Trans-2-enoyl-ACP reductase II
Ligand
BDBM50216898
Substrate
Meas. Tech.
ChEMBL_450119 (CHEMBL900394)
IC50
>32000±n/a nM
Citation
 Ozawa, TKitagawa, HYamamoto, YTakahata, SIida, MOsaki, YYamada, K Phenylimidazole derivatives as specific inhibitors of bacterial enoyl-acyl carrier protein reductase FabK. Bioorg Med Chem 15:7325-36 (2007)  
Target
Name:
Trans-2-enoyl-ACP reductase II
Synonyms:
Enoyl-ACP Reductase (FabK) NADH-dependent, FAD-containing enoyl-ACP | trans-2-enoyl-ACP reductase II
Type:
Enzyme
Mol. Mass.:
34170.89
Organism:
Streptococcus pneumoniae
Description:
Residue:
324
  
Inhibitor
Name:
BDBM50216898
Synonyms:
1-((1H-benzo[d]imidazol-2-yl)methyl)-3-(4-methoxybenzo[d]thiazol-2-yl)urea | CHEMBL237636
Type:
Small organic molecule
Emp. Form.:
C17H15N5O2S
Mol. Mass.:
353.398
SMILES:
COc1cccc2sc(NC(=O)NCc3nc4ccccc4[nH]3)nc12
: