Target
Trans-2-enoyl-ACP reductase II
Ligand
BDBM50216899
Substrate
Meas. Tech.
ChEMBL_450119 (CHEMBL900394)
IC50
30000±n/a nM
Citation
 Ozawa, TKitagawa, HYamamoto, YTakahata, SIida, MOsaki, YYamada, K Phenylimidazole derivatives as specific inhibitors of bacterial enoyl-acyl carrier protein reductase FabK. Bioorg Med Chem 15:7325-36 (2007)  
Target
Name:
Trans-2-enoyl-ACP reductase II
Synonyms:
Enoyl-ACP Reductase (FabK) NADH-dependent, FAD-containing enoyl-ACP | trans-2-enoyl-ACP reductase II
Type:
Enzyme
Mol. Mass.:
34170.89
Organism:
Streptococcus pneumoniae
Description:
Residue:
324
  
Inhibitor
Name:
BDBM50216899
Synonyms:
1-(6-(methylsulfonyl)benzo[d]thiazol-2-yl)-3-(thiophen-2-yl)methyl)urea CHEMBL393500
Type:
Small organic molecule
Emp. Form.:
C14H13N3O3S3
Mol. Mass.:
367.466
SMILES:
CS(=O)(=O)c1ccc2nc(NC(=O)NCc3cccs3)sc2c1
: