Target
Trans-2-enoyl-ACP reductase II
Ligand
BDBM50223361
Substrate
Meas. Tech.
ChEMBL_450119 (CHEMBL900394)
IC50
6400±n/a nM
Citation
 Ozawa, TKitagawa, HYamamoto, YTakahata, SIida, MOsaki, YYamada, K Phenylimidazole derivatives as specific inhibitors of bacterial enoyl-acyl carrier protein reductase FabK. Bioorg Med Chem 15:7325-36 (2007)  
Target
Name:
Trans-2-enoyl-ACP reductase II
Synonyms:
Enoyl-ACP Reductase (FabK) NADH-dependent, FAD-containing enoyl-ACP | trans-2-enoyl-ACP reductase II
Type:
Enzyme
Mol. Mass.:
34170.89
Organism:
Streptococcus pneumoniae
Description:
Residue:
324
  
Inhibitor
Name:
BDBM50223361
Synonyms:
1-((1H-benzo[d]imidazol-2-yl)methyl)-3-(6-fluorobenzo[d]thiazol-2-yl)urea | CHEMBL393299
Type:
Small organic molecule
Emp. Form.:
C16H12FN5OS
Mol. Mass.:
341.363
SMILES:
Fc1ccc2nc(NC(=O)NCc3nc4ccccc4[nH]3)sc2c1
: