Target
Trans-2-enoyl-ACP reductase II
Ligand
BDBM50216886
Substrate
Meas. Tech.
ChEMBL_456803 (CHEMBL923154)
IC50
28000±n/a nM
Citation
 Kitagawa, HOzawa, TTakahata, SIida, M Phenylimidazole derivatives as new inhibitors of bacterial enoyl-ACP reductase FabK. Bioorg Med Chem Lett 17:4982-6 (2007)  
Target
Name:
Trans-2-enoyl-ACP reductase II
Synonyms:
Enoyl-ACP Reductase (FabK) NADH-dependent, FAD-containing enoyl-ACP | trans-2-enoyl-ACP reductase II
Type:
Enzyme
Mol. Mass.:
34170.89
Organism:
Streptococcus pneumoniae
Description:
Residue:
324
  
Inhibitor
Name:
BDBM50216886
Synonyms:
1-((1H-benzo[d]imidazol-2-yl)methyl)-3-(benzo[d]thiazol-2-yl)urea | CHEMBL393298
Type:
Small organic molecule
Emp. Form.:
C16H13N5OS
Mol. Mass.:
323.372
SMILES:
O=C(NCc1nc2ccccc2[nH]1)Nc1nc2ccccc2s1
: