Target
Trans-2-enoyl-ACP reductase II
Ligand
BDBM50216888
Substrate
Meas. Tech.
ChEMBL_456803 (CHEMBL923154)
IC50
24000±n/a nM
Citation
 Kitagawa, HOzawa, TTakahata, SIida, M Phenylimidazole derivatives as new inhibitors of bacterial enoyl-ACP reductase FabK. Bioorg Med Chem Lett 17:4982-6 (2007)  
Target
Name:
Trans-2-enoyl-ACP reductase II
Synonyms:
Enoyl-ACP Reductase (FabK) NADH-dependent, FAD-containing enoyl-ACP | trans-2-enoyl-ACP reductase II
Type:
Enzyme
Mol. Mass.:
34170.89
Organism:
Streptococcus pneumoniae
Description:
Residue:
324
  
Inhibitor
Name:
BDBM50216888
Synonyms:
1-(6-(methylsulfonyl)benzo[d]thiazol-2-yl)-3-(pyridin-3-yl)methyl)urea CHEMBL237450
Type:
Small organic molecule
Emp. Form.:
C15H14N4O3S2
Mol. Mass.:
362.427
SMILES:
CS(=O)(=O)c1ccc2nc(NC(=O)NCc3cccnc3)sc2c1
: