Target
Trans-2-enoyl-ACP reductase II
Ligand
BDBM50371221
Substrate
Meas. Tech.
ChEMBL_456803 (CHEMBL923154)
IC50
>32000±n/a nM
Citation
 Kitagawa, HOzawa, TTakahata, SIida, M Phenylimidazole derivatives as new inhibitors of bacterial enoyl-ACP reductase FabK. Bioorg Med Chem Lett 17:4982-6 (2007)  
Target
Name:
Trans-2-enoyl-ACP reductase II
Synonyms:
Enoyl-ACP Reductase (FabK) NADH-dependent, FAD-containing enoyl-ACP | trans-2-enoyl-ACP reductase II
Type:
Enzyme
Mol. Mass.:
34170.89
Organism:
Streptococcus pneumoniae
Description:
Residue:
324
  
Inhibitor
Name:
BDBM50371221
Synonyms:
CHEMBL246781
Type:
Small organic molecule
Emp. Form.:
C17H12N4O3S2
Mol. Mass.:
384.432
SMILES:
OC(=O)c1ccc2nc(NC(=O)CSc3nc4ccccc4[nH]3)sc2c1
: