Target
Trans-2-enoyl-ACP reductase II
Ligand
BDBM50371224
Substrate
Meas. Tech.
ChEMBL_456803 (CHEMBL923154)
IC50
>32000±n/a nM
Citation
 Kitagawa, HOzawa, TTakahata, SIida, M Phenylimidazole derivatives as new inhibitors of bacterial enoyl-ACP reductase FabK. Bioorg Med Chem Lett 17:4982-6 (2007)  
Target
Name:
Trans-2-enoyl-ACP reductase II
Synonyms:
Enoyl-ACP Reductase (FabK) NADH-dependent, FAD-containing enoyl-ACP | trans-2-enoyl-ACP reductase II
Type:
Enzyme
Mol. Mass.:
34170.89
Organism:
Streptococcus pneumoniae
Description:
Residue:
324
  
Inhibitor
Name:
BDBM50371224
Synonyms:
CHEMBL394385
Type:
Small organic molecule
Emp. Form.:
C9H8N2O2S
Mol. Mass.:
208.237
SMILES:
OC(=O)CSc1nc2ccccc2[nH]1
: