Target
Trans-2-enoyl-ACP reductase II
Ligand
BDBM50216897
Substrate
Meas. Tech.
ChEMBL_456803 (CHEMBL923154)
IC50
>32000±n/a nM
Citation
 Kitagawa, HOzawa, TTakahata, SIida, M Phenylimidazole derivatives as new inhibitors of bacterial enoyl-ACP reductase FabK. Bioorg Med Chem Lett 17:4982-6 (2007)  
Target
Name:
Trans-2-enoyl-ACP reductase II
Synonyms:
Enoyl-ACP Reductase (FabK) NADH-dependent, FAD-containing enoyl-ACP | trans-2-enoyl-ACP reductase II
Type:
Enzyme
Mol. Mass.:
34170.89
Organism:
Streptococcus pneumoniae
Description:
Residue:
324
  
Inhibitor
Name:
BDBM50216897
Synonyms:
2-(1H-benzo[d]imidazol-2-ylthio)-N-(benzo[d]thiazol-2-yl)acetamide | CHEMBL392025
Type:
Small organic molecule
Emp. Form.:
C16H12N4OS2
Mol. Mass.:
340.423
SMILES:
O=C(CSc1nc2ccccc2[nH]1)Nc1nc2ccccc2s1
: