Target
Glutamate receptor 4
Ligand
BDBM50373889
Substrate
Meas. Tech.
ChEMBL_468628 (CHEMBL934445)
Ki
1055±n/a nM
Citation
 Beich-Frandsen, MPickering, DSMirza, OJohansen, TNGreenwood, JVestergaard, BSchousboe, AGajhede, MLiljefors, TKastrup, JS Structures of the ligand-binding core of iGluR2 in complex with the agonists (R)- and (S)-2-amino-3-(4-hydroxy-1,2,5-thiadiazol-3-yl)propionic acid explain their unusual equipotency. J Med Chem 51:1459-63 (2008)  
Target
Name:
Glutamate receptor 4
Synonyms:
GLUR4 GRIA4_HUMAN Glutamate receptor ionotropic AMPA | Glutamate receptor ionotropic, AMPA 4
Type:
PROTEIN
Mol. Mass.:
100881.87
Organism:
Homo sapiens (Human)
Description:
ChEMBL_468628
Residue:
902
  
Inhibitor
Name:
BDBM50373889
Synonyms:
CHEMBL402444
Type:
Small organic molecule
Emp. Form.:
C5H7N3O3S
Mol. Mass.:
189.192
SMILES:
N[C@H](Cc1ns[nH]c1=O)C(O)=O
: