Target
Ribosomal protein S6 kinase beta-1
Ligand
BDBM50237622
Substrate
Meas. Tech.
ChEMBL_475150 (CHEMBL933731)
IC50
120±n/a nM
Citation
 Caldwell, JJDavies, TGDonald, AMcHardy, TRowlands, MGAherne, GWHunter, LKTaylor, KRuddle, RRaynaud, FIVerdonk, MWorkman, PGarrett, MDCollins, I Identification of 4-(4-aminopiperidin-1-yl)-7H-pyrrolo[2,3-d]pyrimidines as selective inhibitors of protein kinase B through fragment elaboration. J Med Chem 51:2147-57 (2008)  
Target
Name:
Ribosomal protein S6 kinase beta-1
Synonyms:
70 kDa ribosomal protein S6 kinase 1 70 kDa ribosomal protein kinase (p70S6K) Protein kinase 70S6K (T412E) RPS6KB1 Ribosomal protein S6 kinase I STK14A p70S6K1
Type:
Enzyme
Mol. Mass.:
59139.89
Organism:
Homo sapiens (Human)
Description:
His-tagged S6K1.
Residue:
525
  
Inhibitor
Name:
BDBM50237622
Synonyms:
4-(4-Chlorobenzyl)-1-(7H-pyrrolo[2,3-d]pyrimidin-4-yl)piperidin- CCT128930 US8796293, 17
Type:
Small organic molecule
Emp. Form.:
C18H20ClN5
Mol. Mass.:
341.838
SMILES:
NC1(Cc2ccc(Cl)cc2)CCN(CC1)c1ncnc2[nH]ccc12
: