Target
RAC-beta serine/threonine-protein kinase
Ligand
BDBM16232
Substrate
Meas. Tech.
ChEMBL_475113 (CHEMBL932635)
IC50
20±n/a nM
Citation
 Caldwell, JJDavies, TGDonald, AMcHardy, TRowlands, MGAherne, GWHunter, LKTaylor, KRuddle, RRaynaud, FIVerdonk, MWorkman, PGarrett, MDCollins, I Identification of 4-(4-aminopiperidin-1-yl)-7H-pyrrolo[2,3-d]pyrimidines as selective inhibitors of protein kinase B through fragment elaboration. J Med Chem 51:2147-57 (2008)  
Target
Name:
RAC-beta serine/threonine-protein kinase
Synonyms:
AKT2 PKB beta Protein kinase B (Akt 2) Protein kinase B, beta RAC-alpha serine/threonine-protein kinase (AKT2) RAC-beta serine/threonine-protein kinase (AKT2) Serine/threonine-protein kinase AKT2 | Serine/threonine-protein kinase Rac alpha/beta
Type:
Enzyme
Mol. Mass.:
55766.64
Organism:
Homo sapiens (Human)
Description:
Residue:
481
  
Inhibitor
Name:
BDBM16232
Synonyms:
6-phenylpurine compound 20 | 6-{4-[4-(4-chlorophenyl)piperidin-4-yl]phenyl}-9H-purine
Type:
Small organic molecule
Emp. Form.:
C22H20ClN5
Mol. Mass.:
389.881
SMILES:
Clc1ccc(cc1)C1(CCNCC1)c1ccc(cc1)-c1ncnc2nc[nH]c12
: