Target
RAC-beta serine/threonine-protein kinase
Ligand
BDBM50376057
Substrate
Meas. Tech.
ChEMBL_475113 (CHEMBL932635)
IC50
180±n/a nM
Citation
 Caldwell, JJDavies, TGDonald, AMcHardy, TRowlands, MGAherne, GWHunter, LKTaylor, KRuddle, RRaynaud, FIVerdonk, MWorkman, PGarrett, MDCollins, I Identification of 4-(4-aminopiperidin-1-yl)-7H-pyrrolo[2,3-d]pyrimidines as selective inhibitors of protein kinase B through fragment elaboration. J Med Chem 51:2147-57 (2008)  
Target
Name:
RAC-beta serine/threonine-protein kinase
Synonyms:
AKT2 PKB beta Protein kinase B (Akt 2) Protein kinase B, beta RAC-alpha serine/threonine-protein kinase (AKT2) RAC-beta serine/threonine-protein kinase (AKT2) Serine/threonine-protein kinase AKT2 | Serine/threonine-protein kinase Rac alpha/beta
Type:
Enzyme
Mol. Mass.:
55766.64
Organism:
Homo sapiens (Human)
Description:
Residue:
481
  
Inhibitor
Name:
BDBM50376057
Synonyms:
CHEMBL259141 | US10227357, Compound P-0541
Type:
Small organic molecule
Emp. Form.:
C11H15N5
Mol. Mass.:
217.2703
SMILES:
NC1CCN(CC1)c1ncnc2[nH]ccc12
: