Target
Glycogen synthase kinase-3 beta
Ligand
BDBM12915
Substrate
Meas. Tech.
ChEMBL_475116 (CHEMBL932638)
IC50
8100±n/a nM
Citation
 Caldwell, JJDavies, TGDonald, AMcHardy, TRowlands, MGAherne, GWHunter, LKTaylor, KRuddle, RRaynaud, FIVerdonk, MWorkman, PGarrett, MDCollins, I Identification of 4-(4-aminopiperidin-1-yl)-7H-pyrrolo[2,3-d]pyrimidines as selective inhibitors of protein kinase B through fragment elaboration. J Med Chem 51:2147-57 (2008)  
Target
Name:
Glycogen synthase kinase-3 beta
Synonyms:
GSK-3 beta GSK3B Glycogen synthase kinase 3 beta (GSK3B) Glycogen synthase kinase-3 beta (GSK-3B) Glycogen synthase kinase-3 beta (GSK3B) Glycogen synthase kinase-3beta (GSK3B) | Serine/threonine-protein kinase GSK3B
Type:
Enzyme
Mol. Mass.:
46756.38
Organism:
Homo sapiens (Human)
Description:
P49841
Residue:
420
  
Inhibitor
Name:
BDBM12915
Synonyms:
2-(4-Morpholinyl)-8-phenyl-4H-1-benzopyran-4-one CHEMBL98350 US10308662, Compound LY294002 | US9505780, LY294002
Type:
Small organic molecule
Emp. Form.:
C19H17NO3
Mol. Mass.:
307.3432
SMILES:
O=c1cc(oc2c(cccc12)-c1ccccc1)N1CCOCC1
: