Target
Sodium-dependent dopamine transporter
Ligand
BDBM30126
Substrate
Meas. Tech.
ChEMBL_560767 (CHEMBL1011734)
Ki
>100000±n/a nM
Citation
 Cashman, JRVoelker, TJohnson, RJanowsky, A Stereoselective inhibition of serotonin re-uptake and phosphodiesterase by dual inhibitors as potential agents for depression. Bioorg Med Chem 17:337-43 (2008)  
Target
Name:
Sodium-dependent dopamine transporter
Synonyms:
DA transporter DAT1 Dopamine transporter protein (DAT) SC6A3_HUMAN Sodium-dependent dopamine transporter Solute carrier family 6 member 3
Type:
Multi-pass membrane protein
Mol. Mass.:
68497.11
Organism:
Homo sapiens (Human)
Description:
Q01959
Residue:
620
  
Inhibitor
Name:
BDBM30126
Synonyms:
CHEMBL313041 | phthalazinone, 19
Type:
Small organic molecule
Emp. Form.:
C16H18N2O3
Mol. Mass.:
286.3257
SMILES:
COc1ccc(cc1OC)C1=NNC(=O)C2CC=CCC12
: