Target
Sodium-dependent serotonin transporter
Ligand
BDBM30126
Substrate
Meas. Tech.
ChEMBL_560768 (CHEMBL1011735)
Ki
>100000±n/a nM
Citation
 Cashman, JRVoelker, TJohnson, RJanowsky, A Stereoselective inhibition of serotonin re-uptake and phosphodiesterase by dual inhibitors as potential agents for depression. Bioorg Med Chem 17:337-43 (2008)  
Target
Name:
Sodium-dependent serotonin transporter
Synonyms:
5-HT Transporter 5HTT SC6A4_HUMAN SLC6A4 Serotonin transporter (5HTT) Sodium-dependent serotonin transporter (SERT) | Solute carrier family 6 member 4
Type:
Multi-pass membrane protein
Mol. Mass.:
70322.51
Organism:
Homo sapiens (Human)
Description:
P31645
Residue:
630
  
Inhibitor
Name:
BDBM30126
Synonyms:
CHEMBL313041 | phthalazinone, 19
Type:
Small organic molecule
Emp. Form.:
C16H18N2O3
Mol. Mass.:
286.3257
SMILES:
COc1ccc(cc1OC)C1=NNC(=O)C2CC=CCC12
: