Target
Sialidase
Ligand
BDBM50175019
Substrate
Meas. Tech.
ChEMBL_565688 (CHEMBL960046)
Ki
143±n/a nM
Citation
 Ryu, YBCurtis-Long, MJLee, JWKim, JHKim, JYKang, KYLee, WSPark, KH Characteristic of neuraminidase inhibitory xanthones from Cudrania tricuspidata. Bioorg Med Chem 17:2744-50 (2009)  
Target
Name:
Sialidase
Synonyms:
NANH_CLOPF | nanH
Type:
PROTEIN
Mol. Mass.:
42808.79
Organism:
Clostridium perfringens
Description:
ChEMBL_991336
Residue:
382
  
Inhibitor
Name:
BDBM50175019
Synonyms:
2,3,8-trihydroxy-6-methoxy-1-(3-methylbut-2-enyl)-5-(2-methylbut-3-en-2-yl)-9H-xanthen-9-one cudraxanthone D
Type:
Small organic molecule
Emp. Form.:
C24H26O6
Mol. Mass.:
410.4596
SMILES:
[#6]-[#8]-c1cc(-[#8])c2c(oc3cc(-[#8])c(-[#8])c(-[#6]\[#6]=[#6](\[#6])-[#6])c3c2=O)c1C([#6])([#6])[#6]=[#6]
: