Target
Sialidase
Ligand
BDBM50278346
Substrate
Meas. Tech.
ChEMBL_565688 (CHEMBL960046)
Ki
136±n/a nM
Citation
 Ryu, YBCurtis-Long, MJLee, JWKim, JHKim, JYKang, KYLee, WSPark, KH Characteristic of neuraminidase inhibitory xanthones from Cudrania tricuspidata. Bioorg Med Chem 17:2744-50 (2009)  
Target
Name:
Sialidase
Synonyms:
NANH_CLOPF | nanH
Type:
PROTEIN
Mol. Mass.:
42808.79
Organism:
Clostridium perfringens
Description:
ChEMBL_991336
Residue:
382
  
Inhibitor
Name:
BDBM50278346
Synonyms:
CHEMBL470844 | Cudratricusxanthone
Type:
Small organic molecule
Emp. Form.:
C23H26O6
Mol. Mass.:
398.4489
SMILES:
[#6]\[#6](-[#6])=[#6]/[#6]-c1c(-[#8])c(-[#8])cc2-[#8]-[#6]-3-[#6](-[#6](=O)-[#6]-[#6](=O)-[#6]-3C([#6])([#6])[#6]=[#6])-[#6](=O)-c12
: