Target
Sialidase
Ligand
BDBM50175018
Substrate
Meas. Tech.
ChEMBL_565687 (CHEMBL960045)
Ki
510.1±n/a nM
Citation
 Ryu, YBCurtis-Long, MJLee, JWKim, JHKim, JYKang, KYLee, WSPark, KH Characteristic of neuraminidase inhibitory xanthones from Cudrania tricuspidata. Bioorg Med Chem 17:2744-50 (2009)  
Target
Name:
Sialidase
Synonyms:
NANH_CLOPF | nanH
Type:
PROTEIN
Mol. Mass.:
42808.79
Organism:
Clostridium perfringens
Description:
ChEMBL_991336
Residue:
382
  
Inhibitor
Name:
BDBM50175018
Synonyms:
4,7,8-trihydroxy-2,3,3-trimethyl-9-(3-methylbut-2-enyl)-2,3-dihydrofuro[3,2-b]xanthen-5-one cudraxanthone M
Type:
Small organic molecule
Emp. Form.:
C23H24O6
Mol. Mass.:
396.4331
SMILES:
[#6]-[#6]1-[#8]-c2cc3oc4c(-[#6]\[#6]=[#6](\[#6])-[#6])c(-[#8])c(-[#8])cc4c(=O)c3c(-[#8])c2C1([#6])[#6]
: