Target
Sialidase
Ligand
BDBM50175013
Substrate
Meas. Tech.
ChEMBL_565687 (CHEMBL960045)
Ki
567.6±n/a nM
Citation
 Ryu, YBCurtis-Long, MJLee, JWKim, JHKim, JYKang, KYLee, WSPark, KH Characteristic of neuraminidase inhibitory xanthones from Cudrania tricuspidata. Bioorg Med Chem 17:2744-50 (2009)  
Target
Name:
Sialidase
Synonyms:
NANH_CLOPF | nanH
Type:
PROTEIN
Mol. Mass.:
42808.79
Organism:
Clostridium perfringens
Description:
ChEMBL_991336
Residue:
382
  
Inhibitor
Name:
BDBM50175013
Synonyms:
1,3,6,7-tetrahydroxy-5-(3-methylbut-2-enyl)-2-(2-methylbut-3-en-2-yl)-9H-xanthen-9-one cudraxanthone L
Type:
Small organic molecule
Emp. Form.:
C23H24O6
Mol. Mass.:
396.4331
SMILES:
[#6]\[#6](-[#6])=[#6]\[#6]-c1c(-[#8])c(-[#8])cc2c1oc1cc(-[#8])c(c(-[#8])c1c2=O)C([#6])([#6])[#6]=[#6]
: