Target
Coagulation factor X
Ligand
BDBM50317098
Substrate
Meas. Tech.
ChEMBL_675275 (CHEMBL1273257)
Ki
1.8±n/a nM
Citation
 Pinto, DJSmallheer, JMCheney, DLKnabb, RMWexler, RR Factor Xa inhibitors: next-generation antithrombotic agents. J Med Chem 53:6243-74 (2010)  
Target
Name:
Coagulation factor X
Synonyms:
Activated coagulation factor X (FXa) Coagulation factor X precursor F10 Factor X heavy chain Factor Xa Stuart-Prower factor
Type:
Enzyme
Mol. Mass.:
54726.60
Organism:
Homo sapiens (Human)
Description:
Residue:
488
  
Inhibitor
Name:
BDBM50317098
Synonyms:
1-(1-{(2S)-3-[(6-chloronaphthalen-2-yl)sulfonyl]-2-hydroxypropanoyl}piperidin-4-yl)tetrahydropyrimidin-2(1H)-one TAK-442
Type:
Small organic molecule
Emp. Form.:
C22H26ClN3O5S
Mol. Mass.:
479.977
SMILES:
O[C@H](CS(=O)(=O)c1ccc2cc(Cl)ccc2c1)C(=O)N1CCC(CC1)N1CCCNC1=O
: