Target
Ceramide glucosyltransferase
Ligand
BDBM50379026
Substrate
Meas. Tech.
ChEMBL_809643 (CHEMBL2015862)
IC50
>10000±n/a nM
Citation
 van den Berg, RJWennekes, TGhisaidoobe, ADonker-Koopman, WEStrijland, ABoot, RGvan der Marel, GAAerts, JMOverkleeft, HS Assessment of partially deoxygenated deoxynojirimycin derivatives as glucosylceramide synthase inhibitors. ACS Med Chem Lett 2:519-522 (2011)  
Target
Name:
Ceramide glucosyltransferase
Synonyms:
CEGT_MOUSE | Ugcg
Type:
PROTEIN
Mol. Mass.:
44844.15
Organism:
Mus musculus
Description:
ChEMBL_809643
Residue:
394
  
Inhibitor
Name:
BDBM50379026
Synonyms:
CHEMBL2011632
Type:
Small organic molecule
Emp. Form.:
C22H39NO4
Mol. Mass.:
381.5494
SMILES:
OC[C@H]1[C@@H](O)[C@H](O)CCN1CCCCCOCC12CC3CC(CC(C3)C1)C2
: