Target
Ceramide glucosyltransferase
Ligand
BDBM50292389
Substrate
Meas. Tech.
ChEMBL_809643 (CHEMBL2015862)
IC50
>10000±n/a nM
Citation
 van den Berg, RJWennekes, TGhisaidoobe, ADonker-Koopman, WEStrijland, ABoot, RGvan der Marel, GAAerts, JMOverkleeft, HS Assessment of partially deoxygenated deoxynojirimycin derivatives as glucosylceramide synthase inhibitors. ACS Med Chem Lett 2:519-522 (2011)  
Target
Name:
Ceramide glucosyltransferase
Synonyms:
CEGT_MOUSE | Ugcg
Type:
PROTEIN
Mol. Mass.:
44844.15
Organism:
Mus musculus
Description:
ChEMBL_809643
Residue:
394
  
Inhibitor
Name:
BDBM50292389
Synonyms:
3-epi-fagomine CHEMBL456583
Type:
Small organic molecule
Emp. Form.:
C6H13NO3
Mol. Mass.:
147.1723
SMILES:
OC[C@H]1NCC[C@H](O)[C@@H]1O
: