Target
Ceramide glucosyltransferase
Ligand
BDBM50379038
Substrate
Meas. Tech.
ChEMBL_809643 (CHEMBL2015862)
IC50
>10000±n/a nM
Citation
 van den Berg, RJWennekes, TGhisaidoobe, ADonker-Koopman, WEStrijland, ABoot, RGvan der Marel, GAAerts, JMOverkleeft, HS Assessment of partially deoxygenated deoxynojirimycin derivatives as glucosylceramide synthase inhibitors. ACS Med Chem Lett 2:519-522 (2011)  
Target
Name:
Ceramide glucosyltransferase
Synonyms:
CEGT_MOUSE | Ugcg
Type:
PROTEIN
Mol. Mass.:
44844.15
Organism:
Mus musculus
Description:
ChEMBL_809643
Residue:
394
  
Inhibitor
Name:
BDBM50379038
Synonyms:
CHEMBL2011642
Type:
Small organic molecule
Emp. Form.:
C21H37NO4
Mol. Mass.:
367.5228
SMILES:
O[C@H]1CN(CCCCCOCC23CC4CC(CC(C4)C2)C3)C[C@@H](O)[C@@H]1O
: