Target
Non-lysosomal glucosylceramidase
Ligand
BDBM50379053
Substrate
Meas. Tech.
ChEMBL_809645 (CHEMBL2015864)
IC50
1000±n/a nM
Citation
 van den Berg, RJWennekes, TGhisaidoobe, ADonker-Koopman, WEStrijland, ABoot, RGvan der Marel, GAAerts, JMOverkleeft, HS Assessment of partially deoxygenated deoxynojirimycin derivatives as glucosylceramide synthase inhibitors. ACS Med Chem Lett 2:519-522 (2011)  
Target
Name:
Non-lysosomal glucosylceramidase
Synonyms:
Beta-glucosidase GBA2_HUMAN SPG46
Type:
PROTEIN
Mol. Mass.:
104639.04
Organism:
Homo sapiens (Human)
Description:
ChEMBL_1435476
Residue:
927
  
Inhibitor
Name:
BDBM50379053
Synonyms:
CHEMBL2011626
Type:
Small organic molecule
Emp. Form.:
C22H39NO4
Mol. Mass.:
381.5494
SMILES:
OC[C@@H]1[C@@H](O)[C@H](O)CCN1CCCCCOCC12CC3CC(CC(C3)C1)C2
: