Target
Fatty acid-binding protein, adipocyte
Ligand
BDBM50381857
Substrate
Meas. Tech.
ChEMBL_817178 (CHEMBL2025789)
Ki
33±n/a nM
Citation
 Xu, QHuang, LLiu, JMa, LChen, TChen, JPeng, FCao, DYang, ZQiu, NQiu, JWang, GLiang, XPeng, AXiang, MWei, YChen, L Design, synthesis and biological evaluation of thiazole- and indole-based derivatives for the treatment of type II diabetes. Eur J Med Chem 52:70-81 (2012)  
Target
Name:
Fatty acid-binding protein, adipocyte
Synonyms:
A-FABP ALBP Adipocyte-type fatty acid-binding protein Fabp4 | Fatty acid-binding protein 4
Type:
PROTEIN
Mol. Mass.:
14709.32
Organism:
Rattus norvegicus
Description:
ChEMBL_817178
Residue:
132
  
Inhibitor
Name:
BDBM50381857
Synonyms:
CHEMBL2023268
Type:
Small organic molecule
Emp. Form.:
C18H14FNO2
Mol. Mass.:
295.3077
SMILES:
OC(=O)\C=C\c1cn(Cc2ccccc2F)c2ccccc12
: